{"text_format":"1","workbook":"xlsx","n_sheets":3,"sheets":["Note Balance","Cumulative Defaults","Collateral Tables"],"not_rendered":{"charts":1,"images":0,"macros":1,"external_links":8,"defined_names":24,"comments":1,"pivot_tables":0},"unopened":[],"bounds":{"document_bytes":16777216,"sheet_cells":100000,"rows_first":2000,"rows_last":500,"rows_between":2000,"halvings":0,"cell_chars":16384,"cell_head_chars":4096},"cells_cut":0,"cells_raw":0,"read":"whole","date_system":"1900"}

{"sheet":"Note Balance","index":0,"n_rows":240,"n_cols":9,"rows_kept":240,"cut":false,"hidden":false,"merged":[]}
[null,null,"TOTAL NOTE BALANCES"]
[null,null,null,"Total Notes","Class A1 Notes","Class A2 Notes","Class B Notes","Class C Notes","Class D Notes"]
[null,null,"Initial Invested Amount",{"$f":"SUM(E3:I3)","v":331000000},105000000,198000000,11300000,10500000,6200000]
["(a)",null,"Invested Amount as at Previous Payment Date:  3 March 2016",{"$f":"SUM(E4:I4)","v":331000000},105000000,198000000,11300000,10500000,6200000]
["(b)",null,"Stated Amount as at Previous Payment Date:  3 March 2016",331000000,105000000,198000000,11300000,10500000,6200000]
["(d)",null,"Principal Payments to Noteholders on Payment Date",74839799.260000005,74839799.260000005,0,0,0,0]
[null,null,"Gross Aggregate Charge-Offs",0,0,0,0,0,0]
[null,null,"Gross Aggregate Reinstatements of charge-offs",0,0,0,0,0,0]
["(e)",null,"Aggregate Charge-Offs for this Collection Period",0,0,0,0,0,0]
["(f)",null,"Reinstatements relating to Charge-offs that have occurred this Collection Period",0,0,0,0,0,0]
[null,null,"Aggregate Carry Over Charge-offs not previously reinstated",0,0,0,0,0,0]
[null,null,"Reinstatements of Carry Over Charge-offs not previously reinstated",0,0,0,0,0,0]
[null,null,"Aggregate Charge-Offs not reinstated and to be carried over to next period",0,0,0,0,0,0]
[null,null,"Invested Amount as at Payment Date:  16 May 2016",{"$f":"SUM(E14:I14)","v":256160200.74000001},30160200.739999995,198000000,11300000,10500000,6200000]
[null,null,"Stated Amount as at Payment Date:  16 May 2016",{"$f":"SUM(E15:I15)","v":256160200.74000001},30160200.739999995,198000000,11300000,10500000,6200000]
[null,null,"Bond Factor at Payment Date:  16 May 2016",null,0.28724000704761898,1,1,1,1]
[null,null,"Coupon Margin",null,6.0000000000000001E-3,1.2999999999999999E-2,0.02,2.5000000000000001E-2,2.4500000000000001E-2]
[null,null,"Coupon Rate (3 month BBSW + margin)",null,2.9100000000000001E-2,3.61E-2,4.3099999999999999E-2,4.8100000000000004E-2,4.7600000000000003E-2]
[null,null,"Days in Coupon Period",null,74,74,74,74,74]
[null,null,"Coupon Entitlement to be paid out on the current Payment Date: 16 May 2016",null,619471.23,1449143.01,98740.33,102393.7,59832.55]
[]
[]
[null,null,"TOTAL NOTE BALANCES"]
[null,null,null,"Total Notes","Class A1 Notes","Class A2 Notes","Class B Notes","Class C Notes","Class D Notes"]
[null,null,"Initial Invested Amount",{"$f":"SUM(E25:I25)","v":331000000},105000000,198000000,11300000,10500000,6200000]
["(a)",null,"Invested Amount as at Previous Payment Date:  16 May 2016",{"$f":"SUM(E26:I26)","v":256160200.74000001},30160200.739999995,198000000,11300000,10500000,6200000]
["(b)",null,"Stated Amount as at Previous Payment Date:  16 May 2016",256160200.74000001,30160200.739999995,198000000,11300000,10500000,6200000]
["(d)",null,"Principal Payments to Noteholders on Payment Date",21349482.670000002,21349482.670000002,0,0,0,0]
[null,null,"Gross Aggregate Charge-Offs",0,0,0,0,0,0]
[null,null,"Gross Aggregate Reinstatements of charge-offs",0,0,0,0,0,0]
["(e)",null,"Aggregate Charge-Offs for this Collection Period",{"$f":"SUM(E31:I31)","v":0},0,0,0,0,0]
["(f)",null,"Reinstatements relating to Charge-offs that have occurred this Collection Period",{"$f":"SUM(E32:I32)","v":0},0,0,0,0,0]
[null,null,"Aggregate Carry Over Charge-offs not previously reinstated",{"$f":"SUM(E33:I33)","v":0},0,0,0,0,0]
[null,null,"Reinstatements of Carry Over Charge-offs not previously reinstated",0,0,0,0,0,0]
[null,null,"Aggregate Charge-Offs not reinstated and to be carried over to next period",{"$f":"SUM(D31:D34)","v":0},0,0,0,0,0]
[null,null,"Invested Amount as at Payment Date:  16 August 2016",{"$f":"SUM(E36:I36)","v":234810718.06999999},8810718.0699999928,198000000,11300000,10500000,6200000]
[null,null,"Stated Amount as at Payment Date:  16 August 2016",{"$f":"SUM(E37:I37)","v":234810718.06999999},8810718.0699999928,198000000,11300000,10500000,6200000]
[null,null,"Bond Factor at Payment Date:  16 August 2016",null,8.39116006666666E-2,1,1,1,1]
[null,null,"Coupon Margin",null,6.0000000000000001E-3,1.2999999999999999E-2,0.02,2.5000000000000001E-2,2.4500000000000001E-2]
[null,null,"Coupon Rate (3 month BBSW + margin)",null,2.5849999999999998E-2,3.2849999999999997E-2,3.9849999999999997E-2,4.4850000000000001E-2,4.4350000000000001E-2]
{"$rows_left_out":201}
{"sheet":"Cumulative Defaults","index":1,"n_rows":14,"n_cols":4,"rows_kept":14,"cut":false,"hidden":false,"merged":[]}
["Cumulative Defaults & Losses"]
[]
["Month","Gross Losses","Recoveries","Net Losses"]
["2016-04-01",2.4018917142857145E-4,0,{"$f":"B4-C4","v":2.4018917142857145E-4}]
["2016-07-01",1.2563261142857142E-3,-2.4793114285714286E-5,1.2811192285714285E-3]
["2016-10-01",1.2563261142857142E-3,2.3424894285714297E-4,1.0220771714285713E-3]
["2017-01-01",1.2563261142857142E-3,2.9124894285714303E-4,9.6507717142857116E-4]
["2017-04-01",1.2935662857142857E-3,4.2511100000000015E-4,8.6845528571428553E-4]
["2017-07-01",1.2935662857142857E-3,5.5897305714285733E-4,7.3459322857142835E-4]
["2017-10-01",2.3818699142857144E-3,5.8754448571428591E-4,1.7943254285714286E-3]
["2018-01-01",3.043033085714286E-3,1.7731556000000004E-3,1.2698774857142856E-3]
["2018-04-01",3.043033085714286E-3,2.5570584571428575E-3,4.8597462857142854E-4]
["2018-07-01",3.043033085714286E-3,2.5570584571428575E-3,4.8597462857142854E-4]
["2018-10-01",{"$f":"B13+'Collateral Tables'!E9/350000000","v":3.043033085714286E-3},{"$f":"+C13+'Collateral Tables'!E23/350000000","v":2.5570584571428575E-3},{"$f":"B14-C14","v":4.8597462857142854E-4}]

{"sheet":"Collateral Tables","index":2,"n_rows":247,"n_cols":47,"rows_kept":247,"cut":false,"hidden":false,"merged":[]}
[null,"CNH CAPITAL AUSTRALIA RECEIVABLES TRUST SERIES 2016-1 (TERM DEAL)"]
[null,"COLLATERAL DATA TABLES"]
[]
[null,"OUTSTANDING RECEIVABLES",null,null,"2018-10-31",null,null,null,"2018-07-31",null,null,null,"2018-04-30",null,null,null,"2018-01-31",null,null,null,"2017-10-31",null,null,null,"2017-07-31",null,null,null,"2017-04-30",null,null,null,"2017-01-31",null,null,null,"2016-10-31",null,null,null,"2016-07-31",null,null,null,"2016-04-30"]
[]
[null,"Opening Balance",null,null,{"$f":"I13","v":63258464.810000174},null,null,null,73685954.750000164,null,null,null,112579688.94000019,null,null,null,127077294.16000021,null,null,null,143113632.80000019,null,null,null,160400376.04000017,null,null,null,213875093.14000008,null,null,null,232985064.79000005,null,null,null,253371003.93000007,null,null,null,275076134.53000009,null,null,null,349999833.42000002]
[null,"Principal Repayments - Scheduled",null,null,{"$f":"MIN('[1]16 Nov 18'!M156,SUM([2]Sheet1!$B$3+[3]Sheet1!$B$3+[4]Sheet1!$B$3))","v":6829749.7400000002},null,null,null,9010185.3100000042,null,null,null,37756769.780000009,null,null,null,12294141.17,null,null,null,10996073.130000001,null,null,null,14256110.440000001,null,null,null,51949874.479999982,null,null,null,19109971.64999998,null,null,null,13038858.939999998,null,null,null,18368178.68,null,null,null,70539694.680000007]
[null,"Principal Repayments - Unscheduled",null,null,{"$f":"'[1]16 Nov 18'!$H$23-'Collateral Tables'!E7","v":1368520.9800000023},null,null,null,1417304.6299999859,null,null,null,1136964.4100000113,null,null,null,1972056.9400000144,null,null,null,4659359.2399999928,null,null,null,3030632.799999997,null,null,null,1511808.559999913,null,null,null,0,null,null,null,7347080.2000000104,null,null,null,2981303.9900000058,null,null,null,4299937.9999999255]
[{"$f":"SUM(AO9:AS9)","v":439714.14},"Charge-Offs",null,null,{"$f":"'[1]16 Nov 18'!$H37","v":0},null,null,null,0,null,null,null,0,null,null,null,231407.11,null,null,null,380906.27,null,null,null,0,null,null,null,13034.06,null,null,null,0,null,null,null,0,null,null,null,355647.93,null,null,null,84066.21]
[null,"Reinstatements"]
[null,"New Receivables Purchased"]
[null,"Non Cash Change in Receivables"]
[null,"Closing Balance",null,null,{"$f":"E6-E7-E8-E9+E10+E11-E12","v":55060194.090000167},null,null,null,63258464.810000174,null,null,null,73685954.750000164,null,null,null,112579688.94000019,null,null,null,127077294.16000021,null,null,null,143113632.80000019,null,null,null,160400376.04000017,null,null,null,213875093.14000008,null,null,null,232985064.79000005,null,null,null,253371003.93000007,null,null,null,275076134.53000009]
[]
[null,"PORTFOLIO STATISTICS"]
[]
[null,"Summary"]
[null,"Number of contracts",null,null,{"$f":"[5]Summary!$B$4","v":1208},null,null,null,1436,null,null,null,1693,null,null,null,2074,null,null,null,2233,null,null,null,2472,null,null,null,2690,null,null,null,3006,null,null,null,3133,null,null,null,3263,null,null,null,3422]
[null,"Average Dollar Value of Loans",null,null,{"$f":"[5]Summary!$B$6","v":45579.630869205386},null,null,null,44051.855717270279,null,null,null,43523.895304193786,null,null,null,54281.431504339482,null,null,null,56908.774814151344,null,null,null,57893.864401294602,null,null,null,59628.392579925814,null,null,null,71149.398915502403,null,null,null,74364.846725183495,null,null,null,77649.710061293183,null,null,null,80384.609739918029]
[null,"Number of contracts closed during the Quarter",null,null,{"$f":"[5]Summary!$B$19","v":228},null,null,null,257,null,null,null,381,null,null,null,157,null,null,null,238,null,null,null,218,null,null,null,315,null,null,null,127,null,null,null,130,null,null,null,157,null,null,null,216]
[null,"Dollar value of contracts closed during the Quarter",null,null,{"$f":"[5]Summary!$B$20","v":4167402.6399999987},null,null,null,4804492.9099999974,null,null,null,13453522.929999985,null,null,null,4423245.9000000013,null,null,null,7890618.4899999984,null,null,null,6562238.0599999968,null,null,null,11939537.530000001,null,null,null,4405939.9600000018,null,null,null,8722235.7299999949,null,null,null,5997812.8599999985,null,null,null,10129289.880000003]
[]
[{"$f":"SUM(AS23)","v":0},"Dollar Value of Recoveries from Collateral",null,null,{"$f":"[5]Summary!$C$16","v":0},null,null,null,0,null,null,null,274366,null,null,null,414963.89000000007,null,null,null,10000,null,null,null,69482.69,null,null,null,46851.72,null,null,null,19950.000000000015,null,null,null,90664.72000000003,null,null,null,-8677.59,null,null,null,0]
[null,"Dollar Value of Recoveries from Other Sources",null,null,0,null,null,null,0,null,null,null,0,null,null,null,0,null,null,null,0,null,null,null,0,null,null,null,0,null,null,null,0,null,null,null,0,null,null,null,0,null,null,null,0]
[]
[null,"Average Term of Contracts (Months)",null,null,{"$f":"[6]Sheet1!$W$1210","v":55.588696698144773},null,null,null,55.216018737271511,null,null,null,54.809650656660473,null,null,null,53.536552206607894,null,null,null,53.165234625656645,null,null,null,52.808167788959686,null,null,null,52.448670668714705,null,null,null,51.548659039522505,null,null,null,51.221268983771495,null,null,null,50.905018498380905,null,null,null,50.602561692977268]
[null,"Average Term to Maturity (Months)",null,null,{"$f":"[6]Sheet1!$X$1210","v":12.362141815145188},null,null,null,14.848700248279059,null,null,null,17.198840563167145,null,null,null,18.014605674926596,null,null,null,20.352376250895166,null,null,null,22.772484506870782,null,null,null,25.111819899695959,null,null,null,26.298385029893218,null,null,null,28.796062261189039,null,null,null,31.261824556602878,null,null,null,33.580143025830573]
[null,"Average Residual / Balloon Payment *",null,null,{"$f":"[6]Sheet1!$AI$1210","v":2.7021944331856125E-2},null,null,null,2.6496906490445445E-2,null,null,null,2.8536757481773027E-2,null,null,null,2.1992720189062769E-2,null,null,null,2.0618780571606873E-2,null,null,null,2.2334975567803873E-2,null,null,null,2.2751675967038917E-2,null,null,null,1.9662870213616519E-2,null,null,null,1.9947715214700443E-2,null,null,null,2.2629991788590827E-2,null,null,null,2.4040809082651878E-2]
[null,"Average Seasoning (Months)",null,null,{"$f":"E26-E27","v":43.226554882999586},null,null,null,40.367318488992453,null,null,null,37.610810093493328,null,null,null,35.521946531681294,null,null,null,32.812858374761475,null,null,null,30.035683282088904,null,null,null,27.336850769018746,null,null,null,25.250274009629287,null,null,null,22.425206722582455,null,null,null,19.643193941778026,null,null,null,17.022418667146695]
[null,"Average Dollar Value of Individual Assets",null,null,{"$f":"E19/E18","v":37.731482507620356},null,null,null,30.676779747402701,null,null,null,25.708148437208379,null,null,null,26.172339201706595,null,null,null,25.48534474435797,null,null,null,23.419848058776132,null,null,null,22.166688691422237,null,null,null,23.669128049069329,null,null,null,23.73598682578471,null,null,null,23.797030358962054,null,null,null,23.490534698982476]
[null,"Weighted Average Interest Rate",null,null,{"$f":"[6]Sheet1!$AA$1210/100","v":3.4826200185937954E-2},null,null,null,3.4812214042108172E-2,null,null,null,3.4876817684175568E-2,null,null,null,3.508781027725897E-2,null,null,null,3.549832767872909E-2,null,null,null,3.571777101991367E-2,null,null,null,3.5843774343977945E-2,null,null,null,3.6137323863452482E-2,null,null,null,3.6244089599937843E-2,null,null,null,3.6462237991813522E-2,null,null,null,3.6655471442132145E-2]
[]
[null,"Payment in Arrears"]
["1. 0 - 30 Days","0 - 30 Days",null,null,{"$f":"IFERROR(VLOOKUP($A34,'[7]Arrears Reporting'!$A$1:$D$6,3,FALSE),0)","v":1200},{"$f":"IFERROR(VLOOKUP($A34,'[7]Arrears Reporting'!$A$1:$D$5,2,FALSE),0)","v":15032.539999999992},{"$f":"F34/F$50","v":2.7302010551267131E-4},null,1433,52325.420000000013,8.271686667888948E-4,null,1687,111762.89,1.5167461747518428E-3,null,2069,31286.35,2.7790403663909767E-4,null,2221,48260.540000000008,3.7977311618892613E-4,null,2463,31851.469999999998,2.225606979351303E-4,null,2677,243095.85999999993,1.5155566713844673E-3,null,2997,43406.450000000004,2.0295233709886277E-4,null,3124,20933.35999999999,8.9848506035647343E-5,null,3255,120639.01000000001,4.7613581715660603E-4,null,3409,279917.05,1.0175984567991395E-3]
["2. 31 - 60 Days","31 - 60 Days",null,null,{"$f":"IFERROR(VLOOKUP($A35,'[7]Arrears Reporting'!$A$1:$D$6,3,FALSE),0)","v":3},{"$f":"IFERROR(VLOOKUP($A35,'[7]Arrears Reporting'!$A$1:$D$5,2,FALSE),0)","v":206132.85000000003},{"$f":"F35/F$50","v":3.7437726729233839E-3},null,3,110344.49000000002,1.7443434697858235E-3,null,5,165307.78999999998,2.243409759171232E-3,null,3,27999.160000000003,2.4870525281804872E-4,null,7,118171.85999999999,9.2992112226762279E-4,null,2,46643.609999999986,3.2592010339912162E-4,null,8,242973.24999999994,1.5147922716802584E-3,null,2,63265.990000000005,2.9580812366303353E-4,null,6,106352.71000000002,4.5647865924736678E-4,null,3,46074.110000000015,1.8184444662313923E-4,null,8,230113.48,8.3654469113860581E-4]
["3. 61 - 90 Days","61 - 90 Days",null,null,{"$f":"IFERROR(VLOOKUP($A36,'[7]Arrears Reporting'!$A$1:$D$6,3,FALSE),0)","v":2},{"$f":"IFERROR(VLOOKUP($A36,'[7]Arrears Reporting'!$A$1:$D$5,2,FALSE),0)","v":35953.61},6.5298734583519745E-4,null,0,0,0,null,1,3042.8799999999937,4.1295251046468807E-5,null,2,21324.730000000003,1.8941898135253445E-4,null,3,113940.22,8.966213889992072E-4,null,2,23394.389999999992,1.6346723608570127E-4,null,3,16262.82,1.0138891442464199E-4,null,6,45416.01,2.1234828858856972E-4,null,0,0,0,null,4,60199.999999999971,2.3759624845087562E-4,null,3,35237.550000000097,1.2810108030712178E-4]
["4. 91 - 120 Days","91 - 120 Days",null,null,{"$f":"IFERROR(VLOOKUP($A37,'[7]Arrears Reporting'!$A$1:$D$6,3,FALSE),0)","v":1},{"$f":"IFERROR(VLOOKUP($A37,'[7]Arrears Reporting'!$A$1:$D$5,2,FALSE),0)","v":4371.5599999999959},7.9396015074962244E-5,null,0,0,0,null,0,0,0,null,0,0,0,null,2,27079.119999999992,2.1309172640948212E-4,null,3,25252.480000000003,1.7645055544980877E-4,null,2,106676.20999999999,6.6506209420230547E-4,null,0,0,0,null,3,19683.799999999992,8.4485243797673918E-5,null,0,0,0,null,1,48099.140000000007,1.7485755382662749E-4]
["5. 121 - 150 Days","121 - 150 Days",null,null,{"$f":"IFERROR(VLOOKUP($A38,'[7]Arrears Reporting'!$A$1:$D$6,3,FALSE),0)","v":2},{"$f":"IFERROR(VLOOKUP($A38,'[7]Arrears Reporting'!$A$1:$D$5,2,FALSE),0)","v":0},0,null,0,0,0,null,0,0,0,null,0,0,0,null,0,0,0,null,2,0,0,null,0,0,0,null,1,2664.4000000000015,1.2457738584155356E-5,null,0,0,0,null,1,5363.4499999999989,2.1168365427804805E-5,null,1,30045.720000000012,1.09226923852688E-4]
["6. 151 - 180 Days","151 - 180 Days",null,null,{"$f":"IFERROR(VLOOKUP($A39,'[7]Arrears Reporting'!$A$1:$D$6,3,FALSE),0)","v":0},{"$f":"IFERROR(VLOOKUP($A39,'[7]Arrears Reporting'!$A$1:$D$5,2,FALSE),0)","v":0},0,null,0,0,0,null,0,0,0,null,0,0,0,null,0,0,0,null,0,0,0,null,0,0,0,null,0,0,0,null,0,0,0,null,0,0,0,null,0,0,0]
[null,"Total",null,null,{"$f":"SUM(E34:E39)","v":1208},{"$f":"SUM(F34:F39)","v":261490.56},{"$f":"SUM(G34:G39)","v":4.7491761393462142E-3},null,1436,162669.91000000003,2.5715121365747183E-3,null,1693,280113.56,3.8014511849695436E-3,null,2074,80610.240000000005,7.1602827080968073E-4,null,2233,307451.74,2.419407353865238E-3,null,2472,127141.94999999998,8.8839859286976195E-4,null,2690,609008.1399999999,3.796799951691673E-3,null,3006,154752.85,7.2356648793462134E-4,null,3133,146969.87,6.3081240908068807E-4,null,3263,232276.57,9.1674487765842569E-4,null,3422,623412.94000000006,2.2663287059241826E-3]
{"$rows_left_out":207}